Target
Amyloid-beta precursor protein
Ligand
BDBM50481609
Substrate
Meas. Tech.
ChEMBL_610840 (CHEMBL1064995)
Ki
0.900000±n/a nM
Citation
 Duan, XHQiao, JPYang, YCui, MCZhou, JNLiu, BL Novel anilinophthalimide derivatives as potential probes for beta-amyloid plaque in the brain. Bioorg Med Chem 18:1337-43 (2010)  
Target
Name:
Amyloid-beta precursor protein
Synonyms:
A4 ABPP AICD-50 AICD-59 AID(57) APP Alzheimer disease amyloid protein Amyloid beta Protein Amyloid beta protein Abeta(1-42) Amyloid intracellular domain 57 Amyloid protein (Abeta42b) Beta amyloid A4 protein Beta-APP42 Beta-amyloid protein 42 C83 CVAP Gamma Secretase Gamma-CTF(57) Gamma-secretase Gamma-secretase C-terminal fragment 57 P3(40) PN-II Protease nexin-II S-APP-beta Soluble APP-beta | beta-Amyloid Precursor Protein (APP)
Type:
Single-pass type I membrane protein
Mol. Mass.:
86890.41
Organism:
Homo sapiens (Human)
Description:
P05067
Residue:
770
  
Inhibitor
Name:
BDBM50481609
Synonyms:
CHEMBL610504
Type:
Small organic molecule
Emp. Form.:
C15H11IN2O2
Mol. Mass.:
378.1645
SMILES:
CN1C(=O)c2ccc(Nc3ccc(I)cc3)cc2C1=O
: