Target
Replicase polyprotein 1ab
Ligand
BDBM50481949
Substrate
Meas. Tech.
ChEMBL_614784 (CHEMBL1113303)
IC50
21700±n/a nM
Citation
 Ryu, YBPark, SJKim, YMLee, JYSeo, WDChang, JSPark, KHRho, MCLee, WS SARS-CoV 3CLpro inhibitory effects of quinone-methide triterpenes from Tripterygium regelii. Bioorg Med Chem Lett 20:1873-6 (2010)  
Target
Name:
Replicase polyprotein 1ab
Synonyms:
3C-like proteinase 3C-like proteinase (SARS-CoV 3Cpro) 3CLp GFL Guanine-N7 methyltransferase Helicase Leader protein Non-structural protein 10 Non-structural protein 3 Non-structural protein 6 Non-structural protein 8 ORF1ab polyprotein PL2-PRO Pol R1AB_SARS RdRp SARS coronavirus main proteinase nsp1 nsp12 nsp14 nsp16 nsp3 nsp5 nsp7 nsp9 pp1ab | rep
Type:
Protein
Mol. Mass.:
790250.81
Organism:
Human SARS coronavirus (SARS-CoV) (Severe acute respiratory syndrome coronavirus)
Description:
P0C6X7
Residue:
7073
  
Inhibitor
Name:
BDBM50481949
Synonyms:
Dihydrocelastrol | acs.jmedchem.1c00409_ST.616
Type:
Small organic molecule
Emp. Form.:
C29H40O4
Mol. Mass.:
452.6255
SMILES:
[H][C@@]12C[C@@](C)(CC[C@]1(C)CC[C@]1(C)C3=CCc4c(C)c(O)c(O)cc4[C@]3(C)CC[C@@]21C)C(O)=O
: