Target
Peptidase
Ligand
BDBM50482777
Substrate
Meas. Tech.
ChEMBL_671925 (CHEMBL1266964)
IC50
2190±n/a nM
Citation
 Kosowska-Shick, KMcGhee, PLAppelbaum, PC Affinity of ceftaroline and other beta-lactams for penicillin-binding proteins from Staphylococcus aureus and Streptococcus pneumoniae. Antimicrob Agents Chemother 54:1670-7 (2010)  
Target
Name:
Peptidase
Synonyms:
MecA Penicillin binding protein 2 prime Penicillin binding protein 2a (PBP2a) Penicillin-binding protein 2'
Type:
PROTEIN
Mol. Mass.:
76113.18
Organism:
Staphylococcus aureus
Description:
ChEMBL_677175
Residue:
668
  
Inhibitor
Name:
BDBM50482777
Synonyms:
CHEBI:204928 | Cefotaxime
Type:
Small organic molecule
Emp. Form.:
C16H17N5O7S2
Mol. Mass.:
455.465
SMILES:
[H][C@]12SCC(COC(C)=O)=C(N1C(=O)[C@H]2NC(=O)C(=N/OC)\c1csc(N)n1)C(O)=O
: