Target
Penicillin-binding protein 2x
Ligand
BDBM50482777
Substrate
Meas. Tech.
ChEMBL_672075 (CHEMBL1267456)
IC50
548±n/a nM
Citation
 Kosowska-Shick, KMcGhee, PLAppelbaum, PC Affinity of ceftaroline and other beta-lactams for penicillin-binding proteins from Staphylococcus aureus and Streptococcus pneumoniae. Antimicrob Agents Chemother 54:1670-7 (2010)  
Target
Name:
Penicillin-binding protein 2x
Synonyms:
PBPX_STRPN | pbpX
Type:
PROTEIN
Mol. Mass.:
82307.00
Organism:
Streptococcus pneumoniae
Description:
ChEMBL_653273
Residue:
750
  
Inhibitor
Name:
BDBM50482777
Synonyms:
CHEBI:204928 | Cefotaxime
Type:
Small organic molecule
Emp. Form.:
C16H17N5O7S2
Mol. Mass.:
455.465
SMILES:
[H][C@]12SCC(COC(C)=O)=C(N1C(=O)[C@H]2NC(=O)C(=N/OC)\c1csc(N)n1)C(O)=O
: