Target
Neuraminidase
Ligand
BDBM50343682
Substrate
Meas. Tech.
ChEMBL_674284 (CHEMBL1274484)
Ki
0.46±n/a nM
Citation
 Mohan, SMcAtamney, SHaselhorst, Tvon Itzstein, MPinto, BM Carbocycles related to oseltamivir as influenza virus group-1-specific neuraminidase inhibitors. Binding to N1 enzymes in the context of virus-like particles. J Med Chem 53:7377-91 (2010)  
Target
Name:
Neuraminidase
Synonyms:
NA | NRAM_I33A0
Type:
PROTEIN
Mol. Mass.:
49687.56
Organism:
Influenza A virus
Description:
ChEMBL_1347422
Residue:
453
  
Inhibitor
Name:
BDBM50343682
Synonyms:
((1S,5R,6R)-6-acetamido-3-carboxy-5-(pentan-3-yloxy)cyclohex-2-enylamino)(amino)methaniminium 2,2,2-trifluoroacetate CHEMBL1270126
Type:
Small organic molecule
Emp. Form.:
C15H26N4O4
Mol. Mass.:
326.3913
SMILES:
[#6]-[#6]-[#6](-[#6]-[#6])-[#8]-[#6@@H]-1-[#6]-[#6](=[#6]-[#6@H](\[#7]=[#6](/[#7])-[#7])-[#6@H]-1-[#7]-[#6](-[#6])=O)-[#6](-[#8])=O
: