Target
Neuraminidase
Ligand
BDBM50343684
Substrate
Meas. Tech.
ChEMBL_674284 (CHEMBL1274484)
Ki
72±n/a nM
Citation
 Mohan, SMcAtamney, SHaselhorst, Tvon Itzstein, MPinto, BM Carbocycles related to oseltamivir as influenza virus group-1-specific neuraminidase inhibitors. Binding to N1 enzymes in the context of virus-like particles. J Med Chem 53:7377-91 (2010)  
Target
Name:
Neuraminidase
Synonyms:
NA | NRAM_I33A0
Type:
PROTEIN
Mol. Mass.:
49687.56
Organism:
Influenza A virus
Description:
ChEMBL_1347422
Residue:
453
  
Inhibitor
Name:
BDBM50343684
Synonyms:
(3S,4R,5R)-4-Acetamido-5-(1-ethyl-propoxy)-3-[4-(1-hydroxypropyl)[1,2,3]triazol-1-yl]cyclohex-1-ene-1-carboxylic Acid CHEMBL1270019
Type:
Small organic molecule
Emp. Form.:
C19H30N4O5
Mol. Mass.:
394.4653
SMILES:
CCC(CC)O[C@@H]1CC(=C[C@@H]([C@H]1NC(C)=O)n1cc(nn1)C(O)CC)C(O)=O
: