Target
Replicase polyprotein 1ab
Ligand
BDBM7460
Substrate
Meas. Tech.
ChEMBL_685004 (CHEMBL1286522)
IC50
23800±n/a nM
Citation
 Ryu, YBJeong, HJKim, JHKim, YMPark, JYKim, DNguyen, TTPark, SJChang, JSPark, KHRho, MCLee, WS Biflavonoids from Torreya nucifera displaying SARS-CoV 3CL(pro) inhibition. Bioorg Med Chem 18:7940-7 (2010)  
Target
Name:
Replicase polyprotein 1ab
Synonyms:
3C-like proteinase 3C-like proteinase (SARS-CoV 3Cpro) 3CLp GFL Guanine-N7 methyltransferase Helicase Leader protein Non-structural protein 10 Non-structural protein 3 Non-structural protein 6 Non-structural protein 8 ORF1ab polyprotein PL2-PRO Pol R1AB_SARS RdRp SARS coronavirus main proteinase nsp1 nsp12 nsp14 nsp16 nsp3 nsp5 nsp7 nsp9 pp1ab | rep
Type:
Protein
Mol. Mass.:
790250.81
Organism:
Human SARS coronavirus (SARS-CoV) (Severe acute respiratory syndrome coronavirus)
Description:
P0C6X7
Residue:
7073
  
Inhibitor
Name:
BDBM7460
Synonyms:
2-(3,4-dihydroxyphenyl)-3,5,7-trihydroxy-4H-chromen-4-one 2-(3,4-dihydroxyphenyl)-3,5,7-trihydroxy-chromone;hydrate Quercetin Quercetin (21) US11021454, Compound Quercetin med.21724, Compound 4
Type:
Small organic molecule
Emp. Form.:
C15H10O7
Mol. Mass.:
302.2357
SMILES:
Oc1cc(O)c2c(c1)oc(-c1ccc(O)c(O)c1)c(O)c2=O
: