Target
Replicase polyprotein 1ab
Ligand
BDBM50323199
Substrate
Meas. Tech.
ChEMBL_685002 (CHEMBL1286520)
Ki
30200±n/a nM
Citation
 Ryu, YBJeong, HJKim, JHKim, YMPark, JYKim, DNguyen, TTPark, SJChang, JSPark, KHRho, MCLee, WS Biflavonoids from Torreya nucifera displaying SARS-CoV 3CL(pro) inhibition. Bioorg Med Chem 18:7940-7 (2010)  
Target
Name:
Replicase polyprotein 1ab
Synonyms:
3C-like proteinase 3C-like proteinase (SARS-CoV 3Cpro) 3CLp GFL Guanine-N7 methyltransferase Helicase Leader protein Non-structural protein 10 Non-structural protein 3 Non-structural protein 6 Non-structural protein 8 ORF1ab polyprotein PL2-PRO Pol R1AB_SARS RdRp SARS coronavirus main proteinase nsp1 nsp12 nsp14 nsp16 nsp3 nsp5 nsp7 nsp9 pp1ab | rep
Type:
Protein
Mol. Mass.:
790250.81
Organism:
Human SARS coronavirus (SARS-CoV) (Severe acute respiratory syndrome coronavirus)
Description:
P0C6X7
Residue:
7073
  
Inhibitor
Name:
BDBM50323199
Synonyms:
5,7-dihydroxy-8-(5-(5-hydroxy-7-methoxy-4-oxo-4H-chromen-2-yl)-2-methoxyphenyl)-2-(4-hydroxyphenyl)-4H-chromen-4-one ginkgetin
Type:
Small organic molecule
Emp. Form.:
C32H22O10
Mol. Mass.:
566.5111
SMILES:
COc1cc2oc(cc(O)c2c(=O)c1)-c1ccc(OC)c(c1)-c1c(O)cc(O)c2c1oc(cc2=O)-c1ccc(O)cc1
: