Target
Replicase polyprotein 1ab
Ligand
BDBM50323196
Substrate
Meas. Tech.
ChEMBL_685002 (CHEMBL1286520)
Ki
80400±n/a nM
Citation
 Ryu, YBJeong, HJKim, JHKim, YMPark, JYKim, DNguyen, TTPark, SJChang, JSPark, KHRho, MCLee, WS Biflavonoids from Torreya nucifera displaying SARS-CoV 3CL(pro) inhibition. Bioorg Med Chem 18:7940-7 (2010)  
Target
Name:
Replicase polyprotein 1ab
Synonyms:
3C-like proteinase 3C-like proteinase (SARS-CoV 3Cpro) 3CLp GFL Guanine-N7 methyltransferase Helicase Leader protein Non-structural protein 10 Non-structural protein 3 Non-structural protein 6 Non-structural protein 8 ORF1ab polyprotein PL2-PRO Pol R1AB_SARS RdRp SARS coronavirus main proteinase nsp1 nsp12 nsp14 nsp16 nsp3 nsp5 nsp7 nsp9 pp1ab | rep
Type:
Protein
Mol. Mass.:
790250.81
Organism:
Human SARS coronavirus (SARS-CoV) (Severe acute respiratory syndrome coronavirus)
Description:
P0C6X7
Residue:
7073
  
Inhibitor
Name:
BDBM50323196
Synonyms:
4'-methylamentoflavone bilobetin
Type:
Small organic molecule
Emp. Form.:
C31H20O10
Mol. Mass.:
552.4845
SMILES:
COc1ccc(cc1-c1c(O)cc(O)c2c1oc(cc2=O)-c1ccc(O)cc1)-c1cc(O)c2c(cc(O)cc2=O)o1
: