Target
Genome polyprotein
Ligand
BDBM50483059
Substrate
Meas. Tech.
ChEMBL_685468 (CHEMBL1285499)
IC50
16600±n/a nM
Citation
 Ramajayam, RTan, KPLiu, HGLiang, PH Synthesis and evaluation of pyrazolone compounds as SARS-coronavirus 3C-like protease inhibitors. Bioorg Med Chem 18:7849-54 (2010)  
Target
Name:
Genome polyprotein
Synonyms:
3C-like proteinase (CVB3 3Cpro) P1A P1C P2A P2C P3B P3D-POL Picornain 3C Protease 2A Protein 2A Protein 2C Protein 3B Protein VP1 Protein VP3 RNA-directed RNA polymerase 3D-POL VPg Virion protein 2 Virion protein 4
Type:
Enzyme
Mol. Mass.:
243464.96
Organism:
Coxsackievirus B3 (strain Nancy)
Description:
P03313
Residue:
2185
  
Inhibitor
Name:
BDBM50483059
Synonyms:
CHEMBL1276871
Type:
Small organic molecule
Emp. Form.:
C24H18N2O4
Mol. Mass.:
398.4107
SMILES:
COc1ccc(cc1)N1N=C(\C(=C\c2ccc(cc2)C(O)=O)C1=O)c1ccccc1
: