Target
Genome polyprotein
Ligand
BDBM50483063
Substrate
Meas. Tech.
ChEMBL_685468 (CHEMBL1285499)
IC50
125500±n/a nM
Citation
 Ramajayam, RTan, KPLiu, HGLiang, PH Synthesis and evaluation of pyrazolone compounds as SARS-coronavirus 3C-like protease inhibitors. Bioorg Med Chem 18:7849-54 (2010)  
Target
Name:
Genome polyprotein
Synonyms:
3C-like proteinase (CVB3 3Cpro) P1A P1C P2A P2C P3B P3D-POL Picornain 3C Protease 2A Protein 2A Protein 2C Protein 3B Protein VP1 Protein VP3 RNA-directed RNA polymerase 3D-POL VPg Virion protein 2 Virion protein 4
Type:
Enzyme
Mol. Mass.:
243464.96
Organism:
Coxsackievirus B3 (strain Nancy)
Description:
P03313
Residue:
2185
  
Inhibitor
Name:
BDBM50483063
Synonyms:
CHEMBL1277136
Type:
Small organic molecule
Emp. Form.:
C23H14Cl2N2O3
Mol. Mass.:
437.275
SMILES:
OC(=O)c1ccc(\C=C2/C(=O)N(N=C2c2ccccc2)c2ccc(Cl)c(Cl)c2)cc1
: