Target
Amyloid-beta precursor protein
Ligand
BDBM50483881
Substrate
Meas. Tech.
ChEMBL_746212 (CHEMBL1775603)
Ki
0.300000±n/a nM
Citation
 Lee, BCKim, JSKim, BSSon, JYHong, SKPark, HSMoon, BSJung, JHJeong, JMKim, SE Aromatic radiofluorination and biological evaluation of 2-aryl-6-[18F]fluorobenzothiazoles as a potential positron emission tomography imaging probe for ?-amyloid plaques. Bioorg Med Chem 19:2980-90 (2011)  
Target
Name:
Amyloid-beta precursor protein
Synonyms:
A4 ABPP AICD-50 AICD-59 AID(57) APP Alzheimer disease amyloid protein Amyloid beta Protein Amyloid beta protein Abeta(1-42) Amyloid intracellular domain 57 Amyloid protein (Abeta42b) Beta amyloid A4 protein Beta-APP42 Beta-amyloid protein 42 C83 CVAP Gamma Secretase Gamma-CTF(57) Gamma-secretase Gamma-secretase C-terminal fragment 57 P3(40) PN-II Protease nexin-II S-APP-beta Soluble APP-beta | beta-Amyloid Precursor Protein (APP)
Type:
Single-pass type I membrane protein
Mol. Mass.:
86890.41
Organism:
Homo sapiens (Human)
Description:
P05067
Residue:
770
  
Inhibitor
Name:
BDBM50483881
Synonyms:
CHEMBL1774643
Type:
Small organic molecule
Emp. Form.:
C15H13FN2S
Mol. Mass.:
272.341
SMILES:
CN(C)c1ccc(cc1)-c1nc2ccc(F)cc2s1
: