Target
Solute carrier family 22 member 3
Ligand
BDBM50149890
Substrate
Meas. Tech.
ChEMBL_838723 (CHEMBL2078549)
Ki
1372000±n/a nM
Citation
 Wu, XHuang, WGanapathy, MEWang, HKekuda, RConway, SJLeibach, FHGanapathy, V Structure, function, and regional distribution of the organic cation transporter OCT3 in the kidney. Am J Physiol Renal Physiol 279:449-58 (2000)  
Target
Name:
Solute carrier family 22 member 3
Synonyms:
EMT Extraneuronal monoamine transporter Organic cation transporter 3 SLC22A3
Type:
PROTEIN
Mol. Mass.:
61292.57
Organism:
Homo sapiens (Human)
Description:
ChEMBL_934315
Residue:
556
  
Inhibitor
Name:
BDBM50149890
Synonyms:
CHEMBL9324 | tetraethylammonium
Type:
Small organic molecule
Emp. Form.:
C8H20N
Mol. Mass.:
130.2506
SMILES:
CC[N+](CC)(CC)CC
: