Target
ATP-dependent translocase ABCB1
Ligand
BDBM50470842
Substrate
Meas. Tech.
ChEMBL_838522 (CHEMBL2078150)
Ki
313000±n/a nM
Citation
 Gao, JMurase, OSchowen, RLAubé, JBorchardt, RT A functional assay for quantitation of the apparent affinities of ligands of P-glycoprotein in Caco-2 cells. Pharm Res 18:171-6 (2001)  
Target
Name:
ATP-dependent translocase ABCB1
Synonyms:
ABCB1 MDR1_HUMAN Multidrug resistance protein 1 P-glycoprotein (P-gp) PGY1
Type:
Protein
Mol. Mass.:
141503.50
Organism:
Homo sapiens (Human)
Description:
P08183
Residue:
1280
  
Inhibitor
Name:
BDBM50470842
Synonyms:
Celiprolol
Type:
Small organic molecule
Emp. Form.:
C20H33N3O4
Mol. Mass.:
379.4937
SMILES:
CCN(CC)C(=O)Nc1ccc(OCC(O)CNC(C)(C)C)c(c1)C(C)=O
: