Target
Amyloid-beta precursor protein
Ligand
BDBM50485236
Substrate
Meas. Tech.
ChEMBL_855790 (CHEMBL2161137)
Ki
2.2±n/a nM
Citation
 Lee, IChoe, YSChoi, JYLee, KHKim, BT Synthesis and evaluation of ¹?F-labeled styryltriazole and resveratrol derivatives for ?-amyloid plaque imaging. J Med Chem 55:883-92 (2012)  
Target
Name:
Amyloid-beta precursor protein
Synonyms:
A4 ABPP AICD-50 AICD-59 AID(57) APP Alzheimer disease amyloid protein Amyloid beta Protein Amyloid beta protein Abeta(1-42) Amyloid intracellular domain 57 Amyloid protein (Abeta42b) Beta amyloid A4 protein Beta-APP42 Beta-amyloid protein 42 C83 CVAP Gamma Secretase Gamma-CTF(57) Gamma-secretase Gamma-secretase C-terminal fragment 57 P3(40) PN-II Protease nexin-II S-APP-beta Soluble APP-beta | beta-Amyloid Precursor Protein (APP)
Type:
Single-pass type I membrane protein
Mol. Mass.:
86890.41
Organism:
Homo sapiens (Human)
Description:
P05067
Residue:
770
  
Inhibitor
Name:
BDBM50485236
Synonyms:
BAY-949172 FLORBETABEN F18 Florbetaben F-18 UNII-TLA7312TOI
Type:
Small organic molecule
Emp. Form.:
C21H26FNO3
Mol. Mass.:
358.437
SMILES:
CNc1ccc(\C=C\c2ccc(OCCOCCOCC[18F])cc2)cc1
: