Target
Tyrosine-protein phosphatase non-receptor type 1
Ligand
BDBM50486310
Substrate
Meas. Tech.
ChEMBL_900572 (CHEMBL3062587)
Ki
11000±n/a nM
Citation
  TBA Med Chem Res 20:714-725 (2011)    Article 
Target
Name:
Tyrosine-protein phosphatase non-receptor type 1
Synonyms:
PTN1_HUMAN PTPN1 Protein tyrosine phosphatase-1B (PTP1B) Protein-tyrosine phosphatase 1B (PTP1B) Tyrosine-protein phosphatase non-receptor type 1 (PTP1B)
Type:
Protein phosphatase
Mol. Mass.:
49963.76
Organism:
Homo sapiens (Human)
Description:
Human recombinant GST-fusion PTP1B (1-435).
Residue:
435
  
Inhibitor
Name:
BDBM50486310
Synonyms:
CHEMBL2235927
Type:
Small organic molecule
Emp. Form.:
C19H16N2O5
Mol. Mass.:
352.3407
SMILES:
CC(=O)C(=O)N(c1ccccc1\C=C\C(N)=O)c1ccccc1C(O)=O
: