Target
Squalene synthase
Ligand
BDBM50029165
Substrate
Meas. Tech.
ChEMBL_202111 (CHEMBL808969)
IC50
56.0±n/a nM
Citation
 Brown, GRButlin, RJChapman, SEakin, MAFoubister, AJFreeman, SGriffiths, DHarrison, PJJohnson, MCMallion, KB Phenoxypropylamines: a new series of squalene synthase inhibitors. J Med Chem 38:4157-60 (1995)  
Target
Name:
Squalene synthase
Synonyms:
FDFT_RAT Farnesyl-diphosphate farnesyltransferase SQS Squalene synthetase
Type:
PROTEIN
Mol. Mass.:
48109.41
Organism:
Rattus norvegicus
Description:
ChEMBL_1336736
Residue:
416
  
Inhibitor
Name:
BDBM50029165
Synonyms:
CHEMBL132207 | [3-(4-Butoxy-phenoxy)-propyl]-isopropyl-amine
Type:
Small organic molecule
Emp. Form.:
C16H27NO2
Mol. Mass.:
265.3911
SMILES:
CCCCOc1ccc(OCCCNC(C)C)cc1
: