Target
Steroid 17-alpha-hydroxylase/17,20 lyase
Ligand
BDBM50029231
Substrate
Meas. Tech.
ChEMBL_50519 (CHEMBL661136)
IC50
670±n/a nM
Citation
 Rowlands, MGBarrie, SEChan, FHoughton, JJarman, MMcCague, RPotter, GA Esters of 3-pyridylacetic acid that combine potent inhibition of 17 alpha-hydroxylase/C17,20-lyase (cytochrome P45017 alpha) with resistance to esterase hydrolysis. J Med Chem 38:4191-7 (1995)  
Target
Name:
Steroid 17-alpha-hydroxylase/17,20 lyase
Synonyms:
CP17A_HUMAN CYP17A1 Cytochrome P450 17A1 Cytochrome P450 C17 (CYP17) Cytochrome P450-C17 P450-C17 Steroid 17-alpha-Monooxygenase (CYP17) Steroid 17-alpha-monooxygenase | cytochrome P450 monooxygenase 17 alpha hydroxylase/17,20-lyase (CYP17)
Type:
Enzyme
Mol. Mass.:
57382.42
Organism:
Homo sapiens (Human)
Description:
E.coli expressing human CYP17
Residue:
508
  
Inhibitor
Name:
BDBM50029231
Synonyms:
2-Methyl-2-pyridin-3-yl-propionic acid (3R,6R)-3,6,8,8-tetramethyl-octahydro-3a,7-methano-azulen-6-yl ester | CHEMBL444068
Type:
Small organic molecule
Emp. Form.:
C24H35NO2
Mol. Mass.:
369.5402
SMILES:
C[C@@H]1CCC2C(C)(C)C3CC12CC[C@@]3(C)OC(=O)C(C)(C)c1cccnc1
: