Target
Steroid 17-alpha-hydroxylase/17,20 lyase
Ligand
BDBM50029242
Substrate
Meas. Tech.
ChEMBL_50524 (CHEMBL661141)
IC50
52±n/a nM
Citation
 Rowlands, MGBarrie, SEChan, FHoughton, JJarman, MMcCague, RPotter, GA Esters of 3-pyridylacetic acid that combine potent inhibition of 17 alpha-hydroxylase/C17,20-lyase (cytochrome P45017 alpha) with resistance to esterase hydrolysis. J Med Chem 38:4191-7 (1995)  
Target
Name:
Steroid 17-alpha-hydroxylase/17,20 lyase
Synonyms:
CP17A_RAT Cyp17a1 Cytochrome P450 17A1 Steroid 17-alpha-hydroxylase/17,20 lyase
Type:
Enzyme
Mol. Mass.:
57255.68
Organism:
Rattus norvegicus (Rat)
Description:
P11715
Residue:
507
  
Inhibitor
Name:
BDBM50029242
Synonyms:
2-Methyl-2-pyridin-3-yl-propionic acid (S)-2,6,6-trimethyl-bicyclo[3.1.1]hept-3-yl ester | CHEMBL337251
Type:
Small organic molecule
Emp. Form.:
C19H27NO2
Mol. Mass.:
301.4232
SMILES:
C[C@H]1C2CC(CC1OC(=O)C(C)(C)c1cccnc1)C2(C)C
: