Target
Coagulation factor X
Ligand
BDBM50029504
Substrate
Meas. Tech.
ChEMBL_48475 (CHEMBL663037)
IC50
32000±n/a nM
Citation
 Shuman, RTRothenberger, RBCampbell, CSSmith, GFGifford-Moore, DSPaschal, JWGesellchen, PD Structure-activity study of tripeptide thrombin inhibitors using alpha-alkyl amino acids and other conformationally constrained amino acid substitutions. J Med Chem 38:4446-53 (1995)  
Target
Name:
Coagulation factor X
Synonyms:
Coagulation factor X FA10_BOVIN | Factor Xa (fXa)
Type:
PROTEIN
Mol. Mass.:
54498.45
Organism:
Bos taurus
Description:
ChEMBL_1364435
Residue:
492
  
Inhibitor
Name:
BDBM50029504
Synonyms:
CHEMBL139490 | {(S)-1-Benzyl-2-[(S)-2-((S)-1-formyl-4-guanidino-butylcarbamoyl)-piperidin-1-yl]-2-oxo-ethyl}-carbamic acid tert-butyl ester
Type:
Small organic molecule
Emp. Form.:
C26H40N6O5
Mol. Mass.:
516.633
SMILES:
CC(C)(C)OC(=O)N[C@@H](Cc1ccccc1)C(=O)N1CCCC[C@H]1C(=O)N[C@@H](CCCNC(N)=N)C=O
: