Target
Coagulation factor X
Ligand
BDBM50029512
Substrate
Meas. Tech.
ChEMBL_48475 (CHEMBL663037)
IC50
18000±n/a nM
Citation
 Shuman, RTRothenberger, RBCampbell, CSSmith, GFGifford-Moore, DSPaschal, JWGesellchen, PD Structure-activity study of tripeptide thrombin inhibitors using alpha-alkyl amino acids and other conformationally constrained amino acid substitutions. J Med Chem 38:4446-53 (1995)  
Target
Name:
Coagulation factor X
Synonyms:
Coagulation factor X FA10_BOVIN | Factor Xa (fXa)
Type:
PROTEIN
Mol. Mass.:
54498.45
Organism:
Bos taurus
Description:
ChEMBL_1364435
Residue:
492
  
Inhibitor
Name:
BDBM50029512
Synonyms:
CHEMBL139910 | tert-butyloxy carbonyl-D-Phe-DL-Pro(5,5-methyl)-Arg-H
Type:
Small organic molecule
Emp. Form.:
C27H42N6O5
Mol. Mass.:
530.6596
SMILES:
CC(C)(C)OC(=O)N[C@@H](Cc1ccccc1)C(=O)N1C(CCC1(C)C)C(=O)N[C@@H](CCCNC(N)=N)C=O
: