Target
Alpha-glucosidase MAL62
Ligand
BDBM50296246
Substrate
Meas. Tech.
ChEMBL_900261 (CHEMBL3068027)
IC50
99800±n/a nM
Citation
  TBA Med Chem Res 21:1762-1770 (2012)    Article 
Target
Name:
Alpha-glucosidase MAL62
Synonyms:
MAL62 MAL6S
Type:
PROTEIN
Mol. Mass.:
68174.43
Organism:
Saccharomyces cerevisiae
Description:
ChEMBL_942538
Residue:
584
  
Inhibitor
Name:
BDBM50296246
Synonyms:
CHEMBL564482 | N-Feruloylserotonin
Type:
Small organic molecule
Emp. Form.:
C20H20N2O4
Mol. Mass.:
352.3838
SMILES:
COc1cc(\C=C\C(=O)NCCc2c[nH]c3ccc(O)cc23)ccc1O
: