Target
Alpha-glucosidase MAL62
Ligand
BDBM18351
Substrate
Meas. Tech.
ChEMBL_900261 (CHEMBL3068027)
IC50
278000±n/a nM
Citation
  TBA Med Chem Res 21:1762-1770 (2012)    Article 
Target
Name:
Alpha-glucosidase MAL62
Synonyms:
MAL62 MAL6S
Type:
PROTEIN
Mol. Mass.:
68174.43
Organism:
Saccharomyces cerevisiae
Description:
ChEMBL_942538
Residue:
584
  
Inhibitor
Name:
BDBM18351
Synonyms:
(2R,3R,4R,5S)-2-(Hydroxymethyl)piperidine-3,4,5-triol, 10 1-Deoxynojirimycin CHEMBL307429 US9181184, 1 | dNM
Type:
natural product
Emp. Form.:
C6H13NO4
Mol. Mass.:
163.1717
SMILES:
OC[C@H]1NC[C@H](O)[C@@H](O)[C@@H]1O
: