Target
Reverse transcriptase/RNaseH
Ligand
BDBM50029660
Substrate
Meas. Tech.
ChEMBL_195839 (CHEMBL799138)
IC50
100±n/a nM
Citation
 Dollé, VFan, ENguyen, CHAubertin, AMKirn, AAndreola, MLJamieson, GTarrago-Litvak, LBisagni, E A new series of pyridinone derivatives as potent non-nucleoside human immunodeficiency virus type 1 specific reverse transcriptase inhibitors. J Med Chem 38:4679-86 (1995)  
Target
Name:
Reverse transcriptase/RNaseH
Synonyms:
HIV-1 Reverse Transcriptase RNase H Reverse transcriptase/RNaseH
Type:
PROTEIN
Mol. Mass.:
65229.15
Organism:
Human immunodeficiency virus 1
Description:
ChEMBL_1473730
Residue:
566
  
Inhibitor
Name:
BDBM50029660
Synonyms:
3-Amino-4-(3,5-dimethyl-phenylsulfanyl)-5-methyl-1H-pyridin-2-one | CHEMBL140532
Type:
Small organic molecule
Emp. Form.:
C14H16N2OS
Mol. Mass.:
260.355
SMILES:
Cc1cc(C)cc(Sc2c(C)c[nH]c(=O)c2N)c1
: