Target
Neutrophil elastase
Ligand
BDBM50029703
Substrate
Meas. Tech.
ChEMBL_64004 (CHEMBL672345)
Ki
0.27±n/a nM
Citation
 Hlasta, DJAckerman, JHCourt, JJFarrell, RPJohnson, JAKofron, JLRobinson, DTTalomie, TGDunlap, RPFranke, CA A novel class of cyclic beta-dicarbonyl leaving groups and their use in the design of benzisothiazolone human leukocyte elastase inhibitors. J Med Chem 38:4687-92 (1995)  
Target
Name:
Neutrophil elastase
Synonyms:
Bone marrow serine protease Coagulation factor X ELANE Elastase HLE Leukocyte elastase Medullasin Neutrophil elastase (HNE) PMN elastase Trypsin
Type:
Enzyme
Mol. Mass.:
28532.38
Organism:
Homo sapiens (Human)
Description:
P08246
Residue:
267
  
Inhibitor
Name:
BDBM50029703
Synonyms:
4-Isopropyl-6-methoxy-1,1-dioxo-2-(1-phenyl-1H-tetrazol-5-ylsulfanylmethyl)-1,2-dihydro-1lambda*6*-benzo[d]isothiazol-3-one WIN-63395
Type:
Small organic molecule
Emp. Form.:
C19H19N5O4S2
Mol. Mass.:
445.515
SMILES:
COc1cc2c(C(=O)N(CSc3nnnn3-c3ccccc3)S2(=O)=O)c(c1)C(C)C
: