Target
Amine oxidase [flavin-containing] A
Ligand
BDBM50029812
Substrate
Meas. Tech.
ChEMBL_122945 (CHEMBL733230)
IC50
4600±n/a nM
Citation
 Lebreton, LCuret, OGueddari, SMazouz, FBernard, SBurstein, CMilcent, R Selective and potent monoamine oxidase type B inhibitors: 2-substituted 5-aryltetrazole derivatives. J Med Chem 38:4786-92 (1996)  
Target
Name:
Amine oxidase [flavin-containing] A
Synonyms:
AOFA_RAT Amine oxidase [flavin-containing] A Monoamine Oxidase Type A (MAO-A) Monoamine oxidase A (MAO-A) Monoamine oxidase type A (MAOA)
Type:
Enzyme
Mol. Mass.:
59515.21
Organism:
Rattus norvegicus (rat)
Description:
Residue:
526
  
Inhibitor
Name:
BDBM50029812
Synonyms:
3-(5-Biphenyl-4-yl-tetrazol-2-yl)-propan-1-ol | CHEMBL144945
Type:
Small organic molecule
Emp. Form.:
C16H16N4O
Mol. Mass.:
280.3244
SMILES:
OCCCn1nnc(n1)-c1ccc(cc1)-c1ccccc1
: