Target
Integrin alpha-IIb/beta-3
Ligand
BDBM50030056
Substrate
Meas. Tech.
ChEMBL_217152 (CHEMBL824581)
IC50
1200±n/a nM
Citation
 Cheng, SCraig, WSMullen, DTschopp, JFDixon, DPierschbacher, MD Design and synthesis of novel cyclic RGD-containing peptides as highly potent and selective integrin alpha IIb beta 3 antagonists. J Med Chem 37:1-8 (1994)  
Target
Name:
Integrin alpha-IIb/beta-3
Synonyms:
Glycoprotein IIb/IIIa
Type:
Mol. Mass.:
Description:
ASSAY_ID of EBI is 30109
Components:
This complex has 2 components.
Component 1
Name:
Integrin beta-3
Synonyms:
CD_antigen=CD61 GPIIIa ITGB3 Platelet membrane glycoprotein IIIa
Type:
Protein
Mol. Mass.:
87038.91
Organism:
Homo sapiens (Human)
Description:
P05106
Residue:
788
  
Component 2
Name:
Integrin alpha-IIb
Synonyms:
CD_antigen=CD41 GPIIb Glycoprotein IIb ITGA2B Integrin alpha-IIb heavy chain Integrin alpha-IIb light chain, form 2 Integrin alpha-V/beta-3 and alpha-IIb/beta 3 | Platelet membrane glycoprotein IIb
Type:
Protein
Mol. Mass.:
113354.85
Organism:
Homo sapiens (Human)
Description:
P08514
Residue:
1039
  
Inhibitor
Name:
BDBM50030056
Synonyms:
CHEMBL2371500 | R(Tmc)-G-H-R-G-D-L-R-C-R
Type:
Small organic molecule
Emp. Form.:
C54H93N25O14S2
Mol. Mass.:
1380.605
SMILES:
CC(C)C[C@H]1NC(=O)[C@H](CC(O)=O)NC(=O)CNC(=O)[C@H](CCCN=C(N)N)NC(=O)[C@@H](Cc2c[nH]cn2)NC(=O)CNC(=O)[C@@H](N)CCCN=C(N)NC(=O)[C@H](N)C2(CCCC2)SSC[C@H](NC(=O)[C@H](CCCN=C(N)N)NC1=O)C(=O)N[C@@H](CCCN=C(N)N)C(O)=O
: