Target
4-hydroxy-3-methylbut-2-enyl diphosphate reductase
Ligand
BDBM50098378
Substrate
Meas. Tech.
ChEMBL_908690 (CHEMBL3065755)
IC50
485000±n/a nM
Citation
 Wang, KWang, WNo, JHZhang, YZhang, YOldfield, E Inhibition of the Fe(4)S(4)-cluster-containing protein IspH (LytB): electron paramagnetic resonance, metallacycles, and mechanisms. J Am Chem Soc 132:6719-27 (2010)  
Target
Name:
4-hydroxy-3-methylbut-2-enyl diphosphate reductase
Synonyms:
(E)-1-hydroxy-2-methyl-but-2-enyl 4-diphosphate reductase (IspH) ispH | lytB
Type:
Enzyme
Mol. Mass.:
32103.05
Organism:
Aquifex aeolicus
Description:
O67625
Residue:
289
  
Inhibitor
Name:
BDBM50098378
Synonyms:
(1-Hydroxy-1-phosphono-2-pyridin-2-yl-ethyl)-phosphonic acid 2-(2-Hydroxy-2,2-bis-phosphono-ethyl)-pyridinium CHEMBL434024
Type:
Small organic molecule
Emp. Form.:
C7H11NO7P2
Mol. Mass.:
283.1123
SMILES:
OC(Cc1ccccn1)(P(O)(O)=O)P(O)(O)=O
: