Target
Acetolactate synthase, chloroplastic
Ligand
BDBM50487171
Substrate
Meas. Tech.
ChEMBL_908731 (CHEMBL3066158)
Ki
1290±n/a nM
Citation
 Chen, CNChen, QLiu, YCZhu, XLNiu, CWXi, ZYang, GF Syntheses and herbicidal activity of new triazolopyrimidine-2-sulfonamides as acetohydroxyacid synthase inhibitor. Bioorg Med Chem 18:4897-904 (2010)  
Target
Name:
Acetolactate synthase, chloroplastic
Synonyms:
AHAS Acetolactate synthase ILVB_ARATH | TZP5
Type:
PROTEIN
Mol. Mass.:
72585.19
Organism:
Arabidopsis thaliana
Description:
ChEMBL_934103
Residue:
670
  
Inhibitor
Name:
BDBM50487171
Synonyms:
CHEMBL2251948
Type:
Small organic molecule
Emp. Form.:
C15H13Cl2N5O4S
Mol. Mass.:
430.266
SMILES:
COC(=O)c1cccc(Cl)c1NS(=O)(=O)c1nc2c(Cl)c(C)nc(C)n2n1
: