Target
Neutrophil elastase
Ligand
BDBM50031207
Substrate
Meas. Tech.
ChEMBL_63969 (CHEMBL677437)
Ki
0.65±n/a nM
Citation
 Edwards, PDZottola, MADavis, MWilliams, JTuthill, PA Peptidyl alpha-ketoheterocyclic inhibitors of human neutrophil elastase. 3. In vitro and in vivo potency of a series of peptidyl alpha-ketobenzoxazoles. J Med Chem 38:3972-82 (1995)  
Target
Name:
Neutrophil elastase
Synonyms:
Bone marrow serine protease Coagulation factor X ELANE Elastase HLE Leukocyte elastase Medullasin Neutrophil elastase (HNE) PMN elastase Trypsin
Type:
Enzyme
Mol. Mass.:
28532.38
Organism:
Homo sapiens (Human)
Description:
P08246
Residue:
267
  
Inhibitor
Name:
BDBM50031207
Synonyms:
2-{(S)-2-[((S)-1-{(S)-2-[4-(4-Chloro-benzenesulfonylaminocarbonyl)-benzoylamino]-3-methyl-butyryl}-pyrrolidine-2-carbonyl)-amino]-3-methyl-butyryl}-benzooxazole-5-carboxylic acid | CHEMBL419800
Type:
Small organic molecule
Emp. Form.:
C37H38ClN5O10S
Mol. Mass.:
780.243
SMILES:
CC(C)[C@H](NC(=O)c1ccc(cc1)C(=O)NS(=O)(=O)c1ccc(Cl)cc1)C(=O)N1CCC[C@H]1C(=O)N[C@@H](C(C)C)C(=O)c1nc2cc(ccc2o1)C(O)=O
: