Target
Cholinesterase
Ligand
BDBM50000766
Substrate
Meas. Tech.
ChEMBL_909635 (CHEMBL3053711)
Ki
43±n/a nM
Citation
  TBA Med Chem Res 14:297-308 (2005)    Article 
Target
Name:
Cholinesterase
Synonyms:
BCHE CHLE_HORSE | Cholinesterase
Type:
Enzyme
Mol. Mass.:
65643.35
Organism:
Equus caballus (Horse)
Description:
P81908
Residue:
574
  
Inhibitor
Name:
BDBM50000766
Synonyms:
CHEMBL12 US9271961, Diazepam
Type:
Small organic molecule
Emp. Form.:
C16H13ClN2O
Mol. Mass.:
284.74
SMILES:
CN1c2ccc(Cl)cc2C(=NCC1=O)c1ccccc1
: