Target
Aryl hydrocarbon receptor
Ligand
BDBM23945
Substrate
Meas. Tech.
ChEMBL_911108 (CHEMBL3055293)
Ki
10423174±n/a nM
Citation
  TBA Med Chem Res 17:212-218 (2008)    Article 
Target
Name:
Aryl hydrocarbon receptor
Synonyms:
AHR BHLHE76 aryl hydrocarbon receptor precursor
Type:
PROTEIN
Mol. Mass.:
96143.77
Organism:
Homo sapiens (Human)
Description:
ChEMBL_1503828
Residue:
848
  
Inhibitor
Name:
BDBM23945
Synonyms:
1-[(Z)-2-(4-fluorophenyl)ethenyl]-3,5-dimethoxybenzene | cis-Stilbene Derivative, 5f
Type:
Small organic molecule
Emp. Form.:
C16H15FO2
Mol. Mass.:
258.2875
SMILES:
COc1cc(OC)cc(\C=C/c2ccc(F)cc2)c1
: