Target
Glycogen synthase kinase-3 beta
Ligand
BDBM50487411
Substrate
Meas. Tech.
ChEMBL_911772 (CHEMBL3055876)
IC50
4.0±n/a nM
Citation
  TBA Med Chem Res 16:461-467 (2007)    Article 
Target
Name:
Glycogen synthase kinase-3 beta
Synonyms:
GSK-3 beta GSK3B Glycogen synthase kinase 3 beta (GSK3B) Glycogen synthase kinase-3 beta (GSK-3B) Glycogen synthase kinase-3 beta (GSK3B) Glycogen synthase kinase-3beta (GSK3B) | Serine/threonine-protein kinase GSK3B
Type:
Enzyme
Mol. Mass.:
46756.38
Organism:
Homo sapiens (Human)
Description:
P49841
Residue:
420
  
Inhibitor
Name:
BDBM50487411
Synonyms:
CHEMBL427882 | CT-20026
Type:
Small organic molecule
Emp. Form.:
C22H23Cl2N9O3
Mol. Mass.:
532.383
SMILES:
CN1CCN(C(=O)C1)c1cnc(NCCNc2ccc(c(N)n2)[N+]([O-])=O)nc1-c1ccc(Cl)cc1Cl
: