Target
Trehalase
Ligand
BDBM50031481
Substrate
Meas. Tech.
ChEMBL_208284 (CHEMBL813582)
IC50
360000±n/a nM
Citation
 Asano, NKizu, HOseki, KTomioka, EMatsui, KOkamoto, MBaba, M N-alkylated nitrogen-in-the-ring sugars: conformational basis of inhibition of glycosidases and HIV-1 replication. J Med Chem 38:2349-56 (1995)  
Target
Name:
Trehalase
Synonyms:
Alpha,alpha-trehalase
Type:
PROTEIN
Mol. Mass.:
63480.07
Organism:
Rattus norvegicus
Description:
ChEMBL_208284
Residue:
557
  
Inhibitor
Name:
BDBM50031481
Synonyms:
(2R,3R,4R,5R)-2,5-Bis-hydroxymethyl-pyrrolidine-3,4-diol 2R,5R-dihydroxymethyl-3R,4R-dihydroxypyrrolidine | CHEMBL312653
Type:
Small organic molecule
Emp. Form.:
C6H13NO4
Mol. Mass.:
163.1717
SMILES:
OC[C@H]1N[C@H](CO)[C@@H](O)[C@@H]1O
: