Target
Alpha-mannosidase 2
Ligand
BDBM50031480
Substrate
Meas. Tech.
ChEMBL_32391 (CHEMBL647923)
IC50
64000±n/a nM
Citation
 Asano, NKizu, HOseki, KTomioka, EMatsui, KOkamoto, MBaba, M N-alkylated nitrogen-in-the-ring sugars: conformational basis of inhibition of glycosidases and HIV-1 replication. J Med Chem 38:2349-56 (1995)  
Target
Name:
Alpha-mannosidase 2
Synonyms:
MA2A1_RAT Mana2 | Mannosidase 2 alpha 1
Type:
PROTEIN
Mol. Mass.:
131265.36
Organism:
Rattus norvegicus
Description:
ChEMBL_32391
Residue:
1148
  
Inhibitor
Name:
BDBM50031480
Synonyms:
(2R,3R,4R)-2-Hydroxymethyl-1-methyl-pyrrolidine-3,4-diol | CHEMBL80148
Type:
Small organic molecule
Emp. Form.:
C6H13NO3
Mol. Mass.:
147.1723
SMILES:
CN1C[C@@H](O)[C@H](O)[C@H]1CO
: