Target
Alpha-mannosidase 2
Ligand
BDBM18351
Substrate
Meas. Tech.
ChEMBL_32497 (CHEMBL641374)
Ki
<50000±n/a nM
Citation
 Asano, NKizu, HOseki, KTomioka, EMatsui, KOkamoto, MBaba, M N-alkylated nitrogen-in-the-ring sugars: conformational basis of inhibition of glycosidases and HIV-1 replication. J Med Chem 38:2349-56 (1995)  
Target
Name:
Alpha-mannosidase 2
Synonyms:
MA2A1_RAT Mana2 | Mannosidase 2 alpha 1
Type:
PROTEIN
Mol. Mass.:
131265.36
Organism:
Rattus norvegicus
Description:
ChEMBL_32391
Residue:
1148
  
Inhibitor
Name:
BDBM18351
Synonyms:
(2R,3R,4R,5S)-2-(Hydroxymethyl)piperidine-3,4,5-triol, 10 1-Deoxynojirimycin CHEMBL307429 US9181184, 1 | dNM
Type:
natural product
Emp. Form.:
C6H13NO4
Mol. Mass.:
163.1717
SMILES:
OC[C@H]1NC[C@H](O)[C@@H](O)[C@@H]1O
: