Target
Lactase/phlorizin hydrolase
Ligand
BDBM50031480
Substrate
Meas. Tech.
ChEMBL_96426 (CHEMBL706374)
IC50
<50000±n/a nM
Citation
 Asano, NKizu, HOseki, KTomioka, EMatsui, KOkamoto, MBaba, M N-alkylated nitrogen-in-the-ring sugars: conformational basis of inhibition of glycosidases and HIV-1 replication. J Med Chem 38:2349-56 (1995)  
Target
Name:
Lactase/phlorizin hydrolase
Synonyms:
LPH_RAT Lct | Lph
Type:
PROTEIN
Mol. Mass.:
217253.31
Organism:
Rattus norvegicus
Description:
ChEMBL_96426
Residue:
1928
  
Inhibitor
Name:
BDBM50031480
Synonyms:
(2R,3R,4R)-2-Hydroxymethyl-1-methyl-pyrrolidine-3,4-diol | CHEMBL80148
Type:
Small organic molecule
Emp. Form.:
C6H13NO3
Mol. Mass.:
147.1723
SMILES:
CN1C[C@@H](O)[C@H](O)[C@H]1CO
: