Target
Alpha-mannosidase
Ligand
BDBM50031484
Substrate
Meas. Tech.
ChEMBL_32498 (CHEMBL641375)
IC50
<50000±n/a nM
Citation
 Asano, NKizu, HOseki, KTomioka, EMatsui, KOkamoto, MBaba, M N-alkylated nitrogen-in-the-ring sugars: conformational basis of inhibition of glycosidases and HIV-1 replication. J Med Chem 38:2349-56 (1995)  
Target
Name:
Alpha-mannosidase
Synonyms:
Mannosidase 2, alpha B1
Type:
PROTEIN
Mol. Mass.:
114350.15
Organism:
Rattus norvegicus
Description:
ChEMBL_32498
Residue:
1009
  
Inhibitor
Name:
BDBM50031484
Synonyms:
(2R,3R,4R)-1-Butyl-2-hydroxymethyl-pyrrolidine-3,4-diol | CHEMBL310229
Type:
Small organic molecule
Emp. Form.:
C9H19NO3
Mol. Mass.:
189.2521
SMILES:
CCCCN1C[C@@H](O)[C@H](O)[C@H]1CO
: