Target
Aryl hydrocarbon receptor
Ligand
BDBM23946
Substrate
Meas. Tech.
ChEMBL_909259 (CHEMBL3056575)
Ki
12.0±n/a nM
Citation
  TBA Med Chem Res 19:864-901 (2010)    Article 
Target
Name:
Aryl hydrocarbon receptor
Synonyms:
AHR BHLHE76 aryl hydrocarbon receptor precursor
Type:
PROTEIN
Mol. Mass.:
96143.77
Organism:
Homo sapiens (Human)
Description:
ChEMBL_1503828
Residue:
848
  
Inhibitor
Name:
BDBM23946
Synonyms:
1-[(Z)-2-(4-ethoxyphenyl)ethenyl]-3,5-dimethoxybenzene | cis-Stilbene Derivative, 5g
Type:
Small organic molecule
Emp. Form.:
C18H20O3
Mol. Mass.:
284.3496
SMILES:
CCOc1ccc(\C=C/c2cc(OC)cc(OC)c2)cc1
: