Target
Adenosine kinase
Ligand
BDBM50366949
Substrate
Meas. Tech.
ChEMBL_912301 (CHEMBL3063318)
Ki
1200±n/a nM
Citation
  TBA Med Chem Res 21:590-600 (2012)    Article 
Target
Name:
Adenosine kinase
Synonyms:
ADK_TOXGO | AK
Type:
PROTEIN
Mol. Mass.:
38353.04
Organism:
Toxoplasma gondii
Description:
ChEMBL_629062
Residue:
363
  
Inhibitor
Name:
BDBM50366949
Synonyms:
BDBM50413728 CHEMBL611841
Type:
Small organic molecule
Emp. Form.:
C17H17FN4O4S
Mol. Mass.:
392.405
SMILES:
OC[C@H]1O[C@H]([C@H](O)[C@@H]1O)n1cnc2c(SCc3ccc(F)cc3)ncnc12
: