Target
Adenosine kinase
Ligand
BDBM50413751
Substrate
Meas. Tech.
ChEMBL_912301 (CHEMBL3063318)
Ki
3000±n/a nM
Citation
  TBA Med Chem Res 21:590-600 (2012)    Article 
Target
Name:
Adenosine kinase
Synonyms:
ADK_TOXGO | AK
Type:
PROTEIN
Mol. Mass.:
38353.04
Organism:
Toxoplasma gondii
Description:
ChEMBL_629062
Residue:
363
  
Inhibitor
Name:
BDBM50413751
Synonyms:
CHEMBL61773
Type:
Small organic molecule
Emp. Form.:
C17H17N5O6S
Mol. Mass.:
419.412
SMILES:
OC[C@H]1O[C@H]([C@H](O)[C@@H]1O)n1cnc2c(SCc3cccc(c3)[N+]([O-])=O)ncnc12
: