Target
Acetylcholine receptor subunit beta-like 2
Ligand
BDBM50487982
Substrate
Meas. Tech.
ChEMBL_917696 (CHEMBL3052327)
IC50
154±n/a nM
Citation
 Zhang, AKayser, HMaienfisch, PCasida, JE Insect nicotinic acetylcholine receptor: conserved neonicotinoid specificity of [(3)H]imidacloprid binding site. J Neurochem 75:1294-303 (2000)  
Target
Name:
Acetylcholine receptor subunit beta-like 2
Synonyms:
ACH4_DROME Acr96Ac Nicotinic acetylcholine receptor beta 2 nAChRbeta2 | nAcRbeta-96
Type:
PROTEIN
Mol. Mass.:
60124.10
Organism:
Drosophila melanogaster
Description:
ChEMBL_109085
Residue:
519
  
Inhibitor
Name:
BDBM50487982
Synonyms:
CHEMBL2269820
Type:
Small organic molecule
Emp. Form.:
C8H9ClN4S
Mol. Mass.:
228.702
SMILES:
CN(Cc1cnc(Cl)s1)C(\C)=N\C#N
: