Target
Adenylate cyclase type 5
Ligand
BDBM50032522
Substrate
Meas. Tech.
ChEMBL_31713 (CHEMBL645373)
EC50
114±n/a nM
Citation
 Knoerzer, TAWatts, VJNichols, DEMailman, RB Synthesis and biological evaluation of a series of substituted benzo[a]phenanthridines as agonists at D1 and D2 dopamine receptors. J Med Chem 38:3062-70 (1995)  
Target
Name:
Adenylate cyclase type 5
Synonyms:
ADCY5_RAT Adcy5 Adenylate cyclase type IX Adenylyl cyclase 5
Type:
PROTEIN
Mol. Mass.:
139188.88
Organism:
Rattus norvegicus
Description:
ChEMBL_31725
Residue:
1262
  
Inhibitor
Name:
BDBM50032522
Synonyms:
(6aR,12bS)-2-Methyl-5,6,6a,7,8,12b-hexahydro-benzo[a]phenanthridine-10,11-diol | CHEMBL319707
Type:
Small organic molecule
Emp. Form.:
C18H19NO2
Mol. Mass.:
281.349
SMILES:
Cc1ccc2CN[C@@H]3CCc4cc(O)c(O)cc4[C@H]3c2c1
: