Target
Cannabinoid receptor 1
Ligand
BDBM50032599
Substrate
Meas. Tech.
ChEMBL_46624 (CHEMBL658880)
IC50
1.4±n/a nM
Citation
 Eissenstat, MABell, MRD'Ambra, TEAlexander, EJDaum, SJAckerman, JHGruett, MDKumar, VEstep, KGOlefirowicz, EM Aminoalkylindoles: structure-activity relationships of novel cannabinoid mimetics. J Med Chem 38:3094-105 (1995)  
Target
Name:
Cannabinoid receptor 1
Synonyms:
Brain-type cannabinoid receptor CB-R CNR1_RAT Cannabinoid receptor Cnr1 | Skr6
Type:
G Protein-Coupled Receptor (GPCR)
Mol. Mass.:
52856.55
Organism:
Rattus norvegicus (rat)
Description:
P20272
Residue:
473
  
Inhibitor
Name:
BDBM50032599
Synonyms:
(4-Methoxy-naphthalen-1-yl)-[1-(2-morpholin-4-yl-ethyl)-1H-indol-3-yl]-methanone | CHEMBL81473
Type:
Small organic molecule
Emp. Form.:
C26H26N2O3
Mol. Mass.:
414.4962
SMILES:
COc1ccc(C(=O)c2cn(CCN3CCOCC3)c3ccccc23)c2ccccc12
: