Target
Cannabinoid receptor 1
Ligand
BDBM50032604
Substrate
Meas. Tech.
ChEMBL_46624 (CHEMBL658880)
IC50
43±n/a nM
Citation
 Eissenstat, MABell, MRD'Ambra, TEAlexander, EJDaum, SJAckerman, JHGruett, MDKumar, VEstep, KGOlefirowicz, EM Aminoalkylindoles: structure-activity relationships of novel cannabinoid mimetics. J Med Chem 38:3094-105 (1995)  
Target
Name:
Cannabinoid receptor 1
Synonyms:
Brain-type cannabinoid receptor CB-R CNR1_RAT Cannabinoid receptor Cnr1 | Skr6
Type:
G Protein-Coupled Receptor (GPCR)
Mol. Mass.:
52856.55
Organism:
Rattus norvegicus (rat)
Description:
P20272
Residue:
473
  
Inhibitor
Name:
BDBM50032604
Synonyms:
CHEMBL323501 | [1-(3-Morpholin-4-yl-propyl)-1H-indol-3-yl]-naphthalen-1-yl-methanone
Type:
Small organic molecule
Emp. Form.:
C26H26N2O2
Mol. Mass.:
398.4968
SMILES:
O=C(c1cn(CCCN2CCOCC2)c2ccccc12)c1cccc2ccccc12
: