Target
Gamma-aminobutyric acid type B receptor subunit 1/2
Ligand
BDBM24183
Substrate
Meas. Tech.
ChEMBL_68425 (CHEMBL682871)
IC50
25±n/a nM
Citation
 Froestl, WMickel, SJHall, RGvon Sprecher, GStrub, DBaumann, PABrugger, FGentsch, CJaekel, JOlpe, HR Phosphinic acid analogues of GABA. 1. New potent and selective GABAB agonists. J Med Chem 38:3297-312 (1995)  
Target
Name:
Gamma-aminobutyric acid type B receptor subunit 1/2
Synonyms:
GABA-B receptor | GABA-B receptor 1/2
Type:
Mol. Mass.:
Description:
ASSAY_ID of EBI is 68423
Components:
This complex has 2 components.
Component 1
Name:
Gamma-aminobutyric acid type B receptor subunit 1
Synonyms:
GABA-B receptor GABA-B-R1 GABBR1 GARABR1 Gb1
Type:
Enzyme Catalytic Domain
Mol. Mass.:
108337.22
Organism:
Homo sapiens (Human)
Description:
Q9UBS5
Residue:
961
  
Component 2
Name:
Gamma-aminobutyric acid type B receptor subunit 2
Synonyms:
GABA-B receptor GABR2_HUMAN GPRC3B
Type:
PROTEIN
Mol. Mass.:
105844.45
Organism:
Homo sapiens (Human)
Description:
EBI_100031
Residue:
941
  
Inhibitor
Name:
BDBM24183
Synonyms:
4-amino-n-[2,3-3H]butyric acid Aminalon GABA [3H]GABA | cid_119
Type:
Radiolabeled ligand
Emp. Form.:
C4H9NO2
Mol. Mass.:
103.1198
SMILES:
NCCCC(O)=O
: