Target
Gamma-aminobutyric acid type B receptor subunit 1/2
Ligand
BDBM50032968
Substrate
Meas. Tech.
ChEMBL_68560 (CHEMBL679647)
IC50
89±n/a nM
Citation
 Froestl, WMickel, SJHall, RGvon Sprecher, GStrub, DBaumann, PABrugger, FGentsch, CJaekel, JOlpe, HR Phosphinic acid analogues of GABA. 1. New potent and selective GABAB agonists. J Med Chem 38:3297-312 (1995)  
Target
Name:
Gamma-aminobutyric acid type B receptor subunit 1/2
Synonyms:
GABA B receptor | GABA-B receptor 1/2
Type:
Mol. Mass.:
Description:
ASSAY_ID of EBI is 68556
Components:
This complex has 2 components.
Component 1
Name:
Gamma-aminobutyric acid type B receptor subunit 1
Synonyms:
GABA B GABA uptake GABA-B-R1 GABABR1 Gabbr1 | Gb1
Type:
Enzyme Catalytic Domain
Mol. Mass.:
111548.69
Organism:
Rattus norvegicus (Rat)
Description:
Q9Z0U4
Residue:
991
  
Component 2
Name:
Gamma-aminobutyric acid type B receptor subunit 2
Synonyms:
GABA B receptor Gabbr2 | Gpr51
Type:
PROTEIN
Mol. Mass.:
105775.46
Organism:
Rattus norvegicus
Description:
O88871
Residue:
940
  
Inhibitor
Name:
BDBM50032968
Synonyms:
(3-Amino-propyl)-difluoromethyl-phosphinic acid | CHEMBL113553
Type:
Small organic molecule
Emp. Form.:
C4H10F2NO2P
Mol. Mass.:
173.0983
SMILES:
NCCCP(O)(=O)C(F)F
: