Target
Interleukin-2
Ligand
BDBM50033061
Substrate
Meas. Tech.
ChEMBL_89079 (CHEMBL698590)
IC50
26±n/a nM
Citation
 Mikol, VPapageorgiou, CBorer, X The role of water molecules in the structure-based design of (5-hydroxynorvaline)-2-cyclosporin: synthesis, biological activity, and crystallographic analysis with cyclophilin A. J Med Chem 38:3361-7 (1995)  
Target
Name:
Interleukin-2
Synonyms:
IL2_MOUSE Il2 TCGF
Type:
PROTEIN
Mol. Mass.:
19394.78
Organism:
Mus musculus
Description:
ChEMBL_89079
Residue:
169
  
Inhibitor
Name:
BDBM50033061
Synonyms:
27-Hydroxymethyl-33-(1-hydroxy-2-methyl-hex-4-enyl)-6,9,18,24-tetraisobutyl-3,21-diisopropyl-1,4,7,10,12,15,19,25,28-nonamethyl-30-propyl-1,4,7,10,13,16,19,22,25,28,31undecaaza-cyclotritriacontan-2,5,8,11,14,17,20,23,26,29,32-undecaone | CHEMBL384726
Type:
Small organic molecule
Emp. Form.:
C64H115N11O13
Mol. Mass.:
1246.6638
SMILES:
CCC[C@H]1NC(=O)[C@@H]([C@H](O)[C@H](C)C\C=C\C)N(C)C(=O)[C@@H](C(C)C)N(C)C(=O)[C@@H](CC(C)C)N(C)C(=O)[C@@H](CC(C)C)N(C)C(=O)[C@H](C)NC(=O)[C@@H](C)NC(=O)[C@@H](CC(C)C)N(C)C(=O)[C@H](NC(=O)[C@@H](CC(C)C)N(C)C(=O)[C@H](CO)N(C)C1=O)C(C)C
: