Target
5-hydroxytryptamine receptor 1B
Ligand
BDBM50033383
Substrate
Meas. Tech.
ChEMBL_2024 (CHEMBL617319)
Kd
1.5±n/a nM
Citation
 Glen, RCMartin, GRHill, APHyde, RMWoollard, PMSalmon, JABuckingham, JRobertson, AD Computer-aided design and synthesis of 5-substituted tryptamines and their pharmacology at the 5-HT1D receptor: discovery of compounds with potential anti-migraine properties. J Med Chem 38:3566-80 (1995)  
Target
Name:
5-hydroxytryptamine receptor 1B
Synonyms:
5-HT-1B 5-HT1B 5HT1B_HUMAN HTR1DB Serotonin (5-HT) receptor Serotonin Receptor 1B
Type:
G Protein-Coupled Receptor (GPCR)
Mol. Mass.:
43579.17
Organism:
Homo sapiens (Human)
Description:
Receptor binding assays were performed using human clone stably expressed in CHO cells
Residue:
390
  
Inhibitor
Name:
BDBM50033383
Synonyms:
(S)-4-((3-(2-(dimethylamino)ethyl)-1H-indol-5-yl)methyl)oxazolidin-2-one 311C90 ZOLMITRIPTAN ZOMIG-ZMT
Type:
Small organic molecule
Emp. Form.:
C16H21N3O2
Mol. Mass.:
287.3568
SMILES:
CN(C)CCc1c[nH]c2ccc(C[C@H]3COC(=O)N3)cc12
: