Target
Delta-type opioid receptor
Ligand
BDBM50033530
Substrate
Meas. Tech.
ChEMBL_146340 (CHEMBL753789)
Ki
230±n/a nM
Citation
 Wang, ZXZhu, YCJin, WQChen, XJChen, JJi, RYChi, ZQ Stereoisomers of N-[1-hydroxy-(2-phenylethyl)-3-methyl-4-piperidyl]- N-phenylpropanamide: synthesis, stereochemistry, analgesic activity, and opioid receptor binding characteristics. J Med Chem 38:3652-9 (1995)  
Target
Name:
Delta-type opioid receptor
Synonyms:
DOR-1 MSL-2 OPRD_MOUSE Oprd1
Type:
Enzyme Catalytic Domain
Mol. Mass.:
40577.25
Organism:
MOUSE
Description:
P32300
Residue:
372
  
Inhibitor
Name:
BDBM50033530
Synonyms:
CHEMBL121211 | N-[(3S,4S)-1-((R)-2-Hydroxy-2-phenyl-ethyl)-3-methyl-piperidin-4-yl]-N-phenyl-propionamide
Type:
Small organic molecule
Emp. Form.:
C23H30N2O2
Mol. Mass.:
366.4965
SMILES:
CCC(=O)N([C@H]1CCN(C[C@H](O)c2ccccc2)C[C@@H]1C)c1ccccc1
: